Target
Genome polyprotein
Ligand
BDBM307541
Substrate
Meas. Tech.
HCV Replicon Luciferase Assay
IC50
4.97±n/a nM
Citation
 Yeung, KKadow, JFBora, ROAnjanappa, PGupta, SV Compounds for the treatment of hepatitis C US Patent  US10150747 Publication Date 12/11/2018 
Target
Name:
Genome polyprotein
Synonyms:
Genome polyprotein RNA polymerase (NS5B)
Type:
Enzyme
Mol. Mass.:
326966.11
Organism:
Hepatitis C virus (HCV)
Description:
Q9WMX2
Residue:
3010
  
Inhibitor
Name:
BDBM307541
Synonyms:
5-(3-((1-Cyanocyclopropyl)carbamoyl)phenyl)-2-(4-fluorophenyl)-N-methyl-6-(2,2,2-trifluoroethoxy)benzofuran-3-carboxamide | US10150747, Example 8
Type:
Small organic molecule
Emp. Form.:
C29H21F4N3O4
Mol. Mass.:
551.4884
SMILES:
CNC(=O)c1c(oc2cc(OCC(F)(F)F)c(cc12)-c1cccc(c1)C(=O)NC1(CC1)C#N)-c1ccc(F)cc1
: