Target
Genome polyprotein
Ligand
BDBM307550
Substrate
Meas. Tech.
HCV Replicon Luciferase Assay
EC50
2.80±n/a nM
Citation
 Yeung, KKadow, JFBora, ROAnjanappa, PGupta, SV Compounds for the treatment of hepatitis C US Patent  US10150747 Publication Date 12/11/2018 
Target
Name:
Genome polyprotein
Synonyms:
Genome polyprotein RNA polymerase (NS5B)
Type:
Enzyme
Mol. Mass.:
326966.11
Organism:
Hepatitis C virus (HCV)
Description:
Q9WMX2
Residue:
3010
  
Inhibitor
Name:
BDBM307550
Synonyms:
N-(2-cyanopropan-2-yl)-5-(6-ethoxy-2-(4-fluorophenyl)-3-(methylcarbamoyl)benzofuran-5-yl)-2-(methoxy-d3)nicotinamide | US10150747, Example 17
Type:
Small organic molecule
Emp. Form.:
C29H27FN4O5
Mol. Mass.:
530.5469
SMILES:
CCOc1cc2oc(c(C(=O)NC)c2cc1-c1cnc(OC)c(c1)C(=O)NC(C)(C)C#N)-c1ccc(F)cc1
: