Target
Orexin receptor type 2
Ligand
BDBM307588
Substrate
Meas. Tech.
FLIPR Ca2+ Flux Assay
IC50
36.1±n/a nM
Citation
 Kuduk, SDLiverton, NLuo, YSkudlarek, JW Pyrrolidine orexin receptor antagonists US Patent  US10150751 Publication Date 12/11/2018 
Target
Name:
Orexin receptor type 2
Synonyms:
HCRTR2 OX2R_HUMAN Orexin receptor type 2 (OR-2) Orexin receptor type 2 (OX2R) Ox-2-R | Ox2-R
Type:
Protein
Mol. Mass.:
50710.53
Organism:
Homo sapiens (Human)
Description:
O43614
Residue:
444
  
Inhibitor
Name:
BDBM307588
Synonyms:
US10150751, Example 25
Type:
Small organic molecule
Emp. Form.:
C20H22N6O2
Mol. Mass.:
378.4277
SMILES:
COc1cccnc1N[C@@H]1C[C@@H](C)N(C1)C(=O)c1ccccc1-n1nccn1
: