Target
Beta-secretase 1 [1-460]
Ligand
BDBM307705
Substrate
Meas. Tech.
TR-FRET Assay
IC50
640±n/a nM
Citation
 Minidis, ARahm, FViklund, J Mono-fluoro beta-secretase inhibitors US Patent  US9650336 Publication Date 5/16/2017 
Target
Name:
Beta-secretase 1 [1-460]
Synonyms:
BACE BACE1_HUMAN Beta-secretase 1 (aa 1-460) | KIAA1149
Type:
Protein
Mol. Mass.:
50987.78
Organism:
Homo sapiens (Human)
Description:
P56817[1-460]
Residue:
460
  
Inhibitor
Name:
BDBM307705
Synonyms:
US9650336, Example 8
Type:
Small organic molecule
Emp. Form.:
C20H17F3N2O
Mol. Mass.:
358.357
SMILES:
CC1(C)COc2ccc(cc2C11C=C(F)C(N)=N1)-c1cc(F)cc(F)c1
: