Target
Mast/stem cell growth factor receptor Kit [D816V]
Ligand
BDBM175629
Substrate
Meas. Tech.
Kit Wild Type Assay
pH
7.5±n/a
Temperature
298.15±n/a K
IC50
<1.00±n/a nM
Comments
extracted
Citation
 Hodous, BL Compositions useful for treating disorders related to kit US Patent  US9688680 Publication Date 6/27/2017 
Target
Name:
Mast/stem cell growth factor receptor Kit [D816V]
Synonyms:
KIT Mast/stem cell growth factor receptor Kit (D816V) SCFR | Tyrosine-protein kinase Kit (Kit)(D816V)
Type:
Protein
Mol. Mass.:
109854.42
Organism:
Homo sapiens (Human)
Description:
Human Kit D816V mutant
Residue:
976
  
Inhibitor
Name:
BDBM175629
Synonyms:
US9688680, 178
Type:
Small organic molecule
Emp. Form.:
C24H20N6O3S
Mol. Mass.:
472.519
SMILES:
CS(=O)(=O)c1ccc(cc1)-c1cc2c(ncnn2c1)N1CC(C1)C(=O)Nc1ccc(cc1)C#N
: