Target
Mast/stem cell growth factor receptor Kit [D816V]
Ligand
BDBM175677
Substrate
Meas. Tech.
Kit Wild Type Assay
pH
7.5±n/a
Temperature
298.15±n/a K
IC50
<1.00±n/a nM
Comments
extracted
Citation
 Hodous, BL Compositions useful for treating disorders related to kit US Patent  US9688680 Publication Date 6/27/2017 
Target
Name:
Mast/stem cell growth factor receptor Kit [D816V]
Synonyms:
KIT Mast/stem cell growth factor receptor Kit (D816V) SCFR | Tyrosine-protein kinase Kit (Kit)(D816V)
Type:
Protein
Mol. Mass.:
109854.42
Organism:
Homo sapiens (Human)
Description:
Human Kit D816V mutant
Residue:
976
  
Inhibitor
Name:
BDBM175677
Synonyms:
US9688680, 222
Type:
Small organic molecule
Emp. Form.:
C28H31N5O3
Mol. Mass.:
485.5774
SMILES:
COC1(CN(C1)c1ncnn2cc(cc12)-c1ccc(cc1)C(C)(C)O)C(=O)NCc1ccc(C)cc1
: