Target
Cyclin-dependent kinase 9
Ligand
BDBM307733
Substrate
Meas. Tech.
TR-FRET Kinase Assay
IC50
12.0±n/a nM
Citation
 Mastracchio, ABruncko, MLai, CMiyashiro, JMTao, ZWoods, KWPenning, TDSouers, AJ Pyridine CDK9 kinase inhibitors US Patent  US9650358 Publication Date 5/16/2017 
Target
Name:
Cyclin-dependent kinase 9
Synonyms:
C-2K CDK9 Cell division cycle 2-like protein kinase 4 Cyclin-Dependent Kinase 9 (CDK9) Serine/threonine-protein kinase PITALRE Tat-associated kinase complex catalytic subunit
Type:
Enzyme Subunit
Mol. Mass.:
42789.13
Organism:
Homo sapiens (Human)
Description:
Residue:
372
  
Inhibitor
Name:
BDBM307733
Synonyms:
(3R)-N-[4-(1-benzyl-3-benzyl-3-cyano-1H-indol-6-yl)-5-chloropyridin-2-yl]piperidine-3-carboxamide | US9650358, Example 29
Type:
Small organic molecule
Emp. Form.:
C34H32ClN5O
Mol. Mass.:
562.104
SMILES:
Clc1cnc(NC(=O)[C@@H]2CCCNC2)cc1-c1ccc2c(c1)N(Cc1ccccc1)CC2(Cc1ccccc1)C#N
: