Target
Cyclin-dependent kinase 9
Ligand
BDBM307748
Substrate
Meas. Tech.
TR-FRET Kinase Assay
IC50
19.0±n/a nM
Citation
 Mastracchio, ABruncko, MLai, CMiyashiro, JMTao, ZWoods, KWPenning, TDSouers, AJ Pyridine CDK9 kinase inhibitors US Patent  US9650358 Publication Date 5/16/2017 
Target
Name:
Cyclin-dependent kinase 9
Synonyms:
C-2K CDK9 Cell division cycle 2-like protein kinase 4 Cyclin-Dependent Kinase 9 (CDK9) Serine/threonine-protein kinase PITALRE Tat-associated kinase complex catalytic subunit
Type:
Enzyme Subunit
Mol. Mass.:
42789.13
Organism:
Homo sapiens (Human)
Description:
Residue:
372
  
Inhibitor
Name:
BDBM307748
Synonyms:
5-chloro-4-[1-(3-fluorobenzyl)-1H-benzimidazol-6-yl]-N-[2-(1-methylpiperidin-4-yl)ethyl]pyridin-2-amine | US9650358, Example 44
Type:
Small organic molecule
Emp. Form.:
C27H29ClFN5
Mol. Mass.:
478.004
SMILES:
CN1CCC(CCNc2cc(c(Cl)cn2)-c2ccc3ncn(Cc4cccc(F)c4)c3c2)CC1
: