Target
Cyclin-dependent kinase 9
Ligand
BDBM307935
Substrate
Meas. Tech.
TR-FRET Kinase Assay
IC50
36.0±n/a nM
Citation
 Mastracchio, ABruncko, MLai, CMiyashiro, JMTao, ZWoods, KWPenning, TDSouers, AJ Pyridine CDK9 kinase inhibitors US Patent  US9650358 Publication Date 5/16/2017 
Target
Name:
Cyclin-dependent kinase 9
Synonyms:
C-2K CDK9 Cell division cycle 2-like protein kinase 4 Cyclin-Dependent Kinase 9 (CDK9) Serine/threonine-protein kinase PITALRE Tat-associated kinase complex catalytic subunit
Type:
Enzyme Subunit
Mol. Mass.:
42789.13
Organism:
Homo sapiens (Human)
Description:
Residue:
372
  
Inhibitor
Name:
BDBM307935
Synonyms:
trans-N-{5-chloro-4-[1-(3-fluorobenzyl)-1H-benzimidazol-6-yl]pyridin-2-yl}-N′-[2-(morpholin-4-yl)ethyl]cyclohexane-1,4-diamine | US9650358, Example 231
Type:
Small organic molecule
Emp. Form.:
C31H36ClFN6O
Mol. Mass.:
563.109
SMILES:
Fc1cccc(Cn2cnc3ccc(cc23)-c2cc(N[C@H]3CC[C@@H](CC3)NCCN3CCOCC3)ncc2Cl)c1
: