Target
Cyclin-dependent kinase 9
Ligand
BDBM308028
Substrate
Meas. Tech.
TR-FRET Kinase Assay
IC50
27.0±n/a nM
Citation
 Mastracchio, ABruncko, MLai, CMiyashiro, JMTao, ZWoods, KWPenning, TDSouers, AJ Pyridine CDK9 kinase inhibitors US Patent  US9650358 Publication Date 5/16/2017 
Target
Name:
Cyclin-dependent kinase 9
Synonyms:
C-2K CDK9 Cell division cycle 2-like protein kinase 4 Cyclin-Dependent Kinase 9 (CDK9) Serine/threonine-protein kinase PITALRE Tat-associated kinase complex catalytic subunit
Type:
Enzyme Subunit
Mol. Mass.:
42789.13
Organism:
Homo sapiens (Human)
Description:
Residue:
372
  
Inhibitor
Name:
BDBM308028
Synonyms:
(3R)-N-{5-chloro-4-[1-(thiophen-2-ylmethyl)-1H-benzimidazol-6-yl]pyridin-2-yl}piperidine-3-carboxamide | US9650358, Example 324
Type:
Small organic molecule
Emp. Form.:
C23H22ClN5OS
Mol. Mass.:
451.972
SMILES:
Clc1cnc(NC(=O)[C@@H]2CCCNC2)cc1-c1ccc2ncn(Cc3cccs3)c2c1
: