Target
Glutaminyl-peptide cyclotransferase
Ligand
BDBM308053
Substrate
Meas. Tech.
Fluorometric Assay
Ki
58.8±n/a nM
Citation
 Heiser, URamsbeck, DSommer, RMeyer, AHoffmann, TBoehme, LDemuth, H Inhibitors US Patent  US9650362 Publication Date 5/16/2017 
Target
Name:
Glutaminyl-peptide cyclotransferase
Synonyms:
Glutaminyl Cyclase Glutaminyl-peptide cyclotransferase Glutaminyl-tRNA cyclotransferase QPCT | QPCT_HUMAN
Type:
Enzyme
Mol. Mass.:
40877.05
Organism:
Homo sapiens (Human)
Description:
Q16769
Residue:
361
  
Inhibitor
Name:
BDBM308053
Synonyms:
(S)-2-(1H-benzo[d]imidazol- 5-yl)-3-(4- propoxyphenyl)isoindolin- 1-one | US9650362, 145
Type:
Small organic molecule
Emp. Form.:
C24H21N3O2
Mol. Mass.:
383.4424
SMILES:
CCCOc1ccc(cc1)[C@@H]1N(C(=O)c2ccccc12)c1ccc2[nH]cnc2c1
: