Target
Beta-secretase 1
Ligand
BDBM116286
Substrate
Meas. Tech.
β-Secretase-Inhibiting Activity
IC50
91.0±n/a nM
Citation
 Hori, AYonezawa, SFujikoshi, CMatsumoto, SKooriyama, YUeno, TKato, T Sulfur-containing heterocyclic derivative having beta secretase inhibitory activity US Patent  US9650371 Publication Date 5/16/2017 
Target
Name:
Beta-secretase 1
Synonyms:
ASP2 Aspartyl protease 2 BACE1 Beta-secretase (BACE) Beta-secretase 1 (BACE 1) Beta-secretase 1 (BACE1) Beta-site amyloid precursor protein cleaving enzyme 1 Memapsin-2 beta-Secretase (BACE-1) | beta-Secretase (BACE1)
Type:
Protein
Mol. Mass.:
55755.10
Organism:
Homo sapiens (Human)
Description:
P56817
Residue:
501
  
Inhibitor
Name:
BDBM116286
Synonyms:
US8637504, 47 US9650371, 47
Type:
Small organic molecule
Emp. Form.:
C18H14F3N5OS
Mol. Mass.:
405.397
SMILES:
NC1=NC(CCS1)(c1cccc(NC(=O)c2ccc(cn2)C#N)c1)C(F)(F)F
: