Target
Beta-secretase 1
Ligand
BDBM116293
Substrate
Meas. Tech.
β-Secretase-Inhibiting Activity
IC50
243±n/a nM
Citation
 Hori, AYonezawa, SFujikoshi, CMatsumoto, SKooriyama, YUeno, TKato, T Sulfur-containing heterocyclic derivative having beta secretase inhibitory activity US Patent  US9650371 Publication Date 5/16/2017 
Target
Name:
Beta-secretase 1
Synonyms:
ASP2 Aspartyl protease 2 BACE1 Beta-secretase (BACE) Beta-secretase 1 (BACE 1) Beta-secretase 1 (BACE1) Beta-site amyloid precursor protein cleaving enzyme 1 Memapsin-2 beta-Secretase (BACE-1) | beta-Secretase (BACE1)
Type:
Protein
Mol. Mass.:
55755.10
Organism:
Homo sapiens (Human)
Description:
P56817
Residue:
501
  
Inhibitor
Name:
BDBM116293
Synonyms:
US8637504, 60 US9650371, 60
Type:
Small organic molecule
Emp. Form.:
C21H20FN7O2S
Mol. Mass.:
453.493
SMILES:
Cn1ccnc1COc1cnc(cn1)C(=O)Nc1ccc(F)c(c1)[C@]1(C)C=CSC(N)=N1
: