Target
Metabotropic glutamate receptor 1
Ligand
BDBM135951
Substrate
Meas. Tech.
Induced Intracellular Calcium Assay
IC50
15.0±n/a nM
Citation
 Behnke, DCarcache, DErtl, PKoller, MOrain, D Diazepinone derivatives US Patent  US9650377 Publication Date 5/16/2017 
Target
Name:
Metabotropic glutamate receptor 1
Synonyms:
GPRC1A GRM1_HUMAN Metabotropic Glutamate 1a | metabotropic glutamate 1
Type:
Enzyme
Mol. Mass.:
132358.19
Organism:
Homo sapiens (Human)
Description:
Q13255
Residue:
1194
  
Inhibitor
Name:
BDBM135951
Synonyms:
US8853203, 5 | US9650377, Example 5
Type:
Small organic molecule
Emp. Form.:
C18H16N2O2S
Mol. Mass.:
324.397
SMILES:
COc1cccc2C3=CC(=NCC(=O)N3CCc12)c1cccs1
: