Target
Metabotropic glutamate receptor 1
Ligand
BDBM135975
Substrate
Meas. Tech.
Induced Intracellular Calcium Assay
IC50
8.00±n/a nM
Citation
 Behnke, DCarcache, DErtl, PKoller, MOrain, D Diazepinone derivatives US Patent  US9650377 Publication Date 5/16/2017 
Target
Name:
Metabotropic glutamate receptor 1
Synonyms:
GPRC1A GRM1_HUMAN Metabotropic Glutamate 1a | metabotropic glutamate 1
Type:
Enzyme
Mol. Mass.:
132358.19
Organism:
Homo sapiens (Human)
Description:
Q13255
Residue:
1194
  
Inhibitor
Name:
BDBM135975
Synonyms:
US8853203, 29 | US9650377, Example 39
Type:
Small organic molecule
Emp. Form.:
C17H13BrN2OS
Mol. Mass.:
373.267
SMILES:
Brc1cccc2C3=CC(=NCC(=O)N3CCc12)c1cccs1
: