Target
Metabotropic glutamate receptor 1
Ligand
BDBM135981
Substrate
Meas. Tech.
Induced Intracellular Calcium Assay
IC50
15.0±n/a nM
Citation
 Behnke, DCarcache, DErtl, PKoller, MOrain, D Diazepinone derivatives US Patent  US9650377 Publication Date 5/16/2017 
Target
Name:
Metabotropic glutamate receptor 1
Synonyms:
GPRC1A GRM1_HUMAN Metabotropic Glutamate 1a | metabotropic glutamate 1
Type:
Enzyme
Mol. Mass.:
132358.19
Organism:
Homo sapiens (Human)
Description:
Q13255
Residue:
1194
  
Inhibitor
Name:
BDBM135981
Synonyms:
US8853203, 35 | US9650377, Example 35
Type:
Small organic molecule
Emp. Form.:
C19H19IN4O
Mol. Mass.:
446.2848
SMILES:
CC(C)n1cc(cn1)C1=NCC(=O)N2CCc3c(I)cccc3C2=C1
: