Target
Metabotropic glutamate receptor 5
Ligand
BDBM136107
Substrate
Meas. Tech.
Induced Intracellular Calcium Assay
IC50
12.0±n/a nM
Citation
 Behnke, DCarcache, DErtl, PKoller, MOrain, D Diazepinone derivatives US Patent  US9650377 Publication Date 5/16/2017 
Target
Name:
Metabotropic glutamate receptor 5
Synonyms:
GPRC1E GRM5_HUMAN metabotropic glutamate 5 | metabotropic glutamate 5a
Type:
Enzyme
Mol. Mass.:
132484.72
Organism:
Homo sapiens (Human)
Description:
Residue:
1212
  
Inhibitor
Name:
BDBM136107
Synonyms:
US8853203, 123a | US9650377, Example 123a
Type:
Small organic molecule
Emp. Form.:
C22H19N5O2
Mol. Mass.:
385.4186
SMILES:
O=C1CN=C(C=C2N1CCc1c(cccc21)C1CC1)n1cnc(c1)-c1cnco1
: