Target
Proto-oncogene tyrosine-protein kinase Src
Ligand
BDBM8798
Substrate
poly-Glu-Ala-Tyr
Meas. Tech.
Homogeneous Time-resolved Fluorescence (HTRF) Assay
IC50
12.5±n/a nM
Citation
 Burchat, AFCalderwood, DJFriedman, MMHirst, GCLi, BRafferty, PRitter, KSkinner, BS Pyrazolo[3,4-d]pyrimidines containing an extended 3-substituent as potent inhibitors of Lck - a selectivity insight. Bioorg Med Chem Lett 12:1687-90 (2002)  
Target
Name:
Proto-oncogene tyrosine-protein kinase Src
Synonyms:
Calmodulin/Proto-oncogene tyrosine-protein kinase Src Proto-oncogene c-Src SRC SRC_HUMAN V-src sarcoma (Schmidt-Ruppin A-2) viral oncogene homolog (avian) p60-Src | pp60c-src
Type:
Protein
Mol. Mass.:
59838.60
Organism:
Homo sapiens (Human)
Description:
P12931
Residue:
536
  
Inhibitor
Name:
BDBM8798
Synonyms:
CHEMBL47787 benzyl N-(4-{4-amino-1-[4-(4-methylpiperazin-1-yl)cyclohexyl]-1H-pyrazolo[3,4-d]pyrimidin-3-yl}-2-methoxyphenyl)carbamate
Type:
Small organic molecule
Emp. Form.:
C31H38N8O3
Mol. Mass.:
570.6852
SMILES:
COc1cc(ccc1NC(=O)OCc1ccccc1)-c1nn([C@H]2CC[C@@H](CC2)N2CCN(C)CC2)c2ncnc(N)c12
:
Substrate
Name:
poly-Glu-Ala-Tyr
Synonyms:
poly-Glu-Ala-Tyr-biotin
Type:
Random Copolymer
Mol. Mass.:
358.43
Organism:
Description:
It is a synthetic polymer of glutamic acid, alanine and tyrosine (poly-Glu-Ala-Tyr) that has been biotinylated.
Residue:
3
NA