Target
P2X purinoceptor 7
Ligand
BDBM173675
Substrate
Meas. Tech.
In Vitro Assay
IC50
2.60±n/a nM
Citation
 Kilburn, JPRasmussen, LKJessing, MEldemenky, EMChen, BJiang, YHopper, AT Benzamide-containing compounds and their use in the treatment of pain US Patent  US9649308 Publication Date 5/16/2017 
Target
Name:
P2X purinoceptor 7
Synonyms:
ATP receptor P2RX7_HUMAN P2X purinoceptor 7 (P2X7) P2Z receptor | Purinergic receptor
Type:
Protein
Mol. Mass.:
68602.85
Organism:
Homo sapiens (Human)
Description:
Q99572
Residue:
595
  
Inhibitor
Name:
BDBM173675
Synonyms:
US9102591, (+)2,3-dichloro-N-[3-cyclopropyl-2-[6-(trifluoromethyl)-3-pyridyl]propyl]benzamide US9102591, 2,3-dichloro-N-[3-cyclopropyl-2-[6-(trifluoromethyl)-3-pyridyl]propyl]benzamide | US9649308, (-)2,3-dichloro-N-[3-cyclopropyl-2-[6-(trifluoromethyl)-3-pyridyl]propyl]benzamide
Type:
Small organic molecule
Emp. Form.:
C19H17Cl2F3N2O
Mol. Mass.:
417.252
SMILES:
FC(F)(F)c1ccc(cn1)C(CNC(=O)c1cccc(Cl)c1Cl)CC1CC1
: