Target
P2X purinoceptor 7
Ligand
BDBM173694
Substrate
Meas. Tech.
In Vitro Assay
IC50
0.76±n/a nM
Citation
 Kilburn, JPRasmussen, LKJessing, MEldemenky, EMChen, BJiang, YHopper, AT Benzamide-containing compounds and their use in the treatment of pain US Patent  US9649308 Publication Date 5/16/2017 
Target
Name:
P2X purinoceptor 7
Synonyms:
ATP receptor P2RX7_HUMAN P2X purinoceptor 7 (P2X7) P2Z receptor | Purinergic receptor
Type:
Protein
Mol. Mass.:
68602.85
Organism:
Homo sapiens (Human)
Description:
Q99572
Residue:
595
  
Inhibitor
Name:
BDBM173694
Synonyms:
US9102591, 2,3-dichloro-N-[2-(6-cyclopropyl-3-pyridyl)-3-[1-(difluoromethyl)cyclopropyl]propyl]benzamide | US9649308, 2,3-dichloro-N-[2-(6-cyclopropyl-3-pyridyl)-3-[1-(difluoromethyl)cyclopropyl]propyl]benzamide
Type:
Small organic molecule
Emp. Form.:
C22H22Cl2F2N2O
Mol. Mass.:
439.326
SMILES:
FC(F)C1(CC(CNC(=O)c2cccc(Cl)c2Cl)c2ccc(nc2)C2CC2)CC1
: