Target
P2X purinoceptor 7
Ligand
BDBM173852
Substrate
Meas. Tech.
In Vitro Assay
IC50
1.90±n/a nM
Citation
 Kilburn, JPRasmussen, LKJessing, MEldemenky, EMChen, BJiang, YHopper, AT Benzamide-containing compounds and their use in the treatment of pain US Patent  US9649308 Publication Date 5/16/2017 
Target
Name:
P2X purinoceptor 7
Synonyms:
ATP receptor P2RX7_HUMAN P2X purinoceptor 7 (P2X7) P2Z receptor | Purinergic receptor
Type:
Protein
Mol. Mass.:
68602.85
Organism:
Homo sapiens (Human)
Description:
Q99572
Residue:
595
  
Inhibitor
Name:
BDBM173852
Synonyms:
US9102591, (+)2,3-dichloro-N-[3-cyclopropyl-2-[6-(difluoromethyl)-3-pyridyl]propyl]benzamide | US9649308, (-)2,3-dichloro-N-[3-cyclopropyl-2-[6-(difluoromethyl)-3-pyridyl]propyl]benzamide
Type:
Small organic molecule
Emp. Form.:
C19H18Cl2F2N2O
Mol. Mass.:
399.262
SMILES:
FC(F)c1ccc(cn1)C(CNC(=O)c1cccc(Cl)c1Cl)CC1CC1
: