Target
Growth arrest-specific protein 6
Ligand
BDBM308300
Substrate
Meas. Tech.
Activity Assay
IC50
847±n/a nM
Citation
 Wang, XZhang, WFrye, S Therapeutic uses of selected pyrimidine compounds with anti-Mer tyrosine kinase activity US Patent  US9649309 Publication Date 5/16/2017 
Target
Name:
Growth arrest-specific protein 6
Synonyms:
AXL receptor tyrosine kinase ligand GAS-6 GAS6_HUMAN
Type:
PROTEIN
Mol. Mass.:
74914.43
Organism:
Homo sapiens (Human)
Description:
Q14393
Residue:
678
  
Inhibitor
Name:
BDBM308300
Synonyms:
US9649309, Compound UNC3199A
Type:
Small organic molecule
Emp. Form.:
C23H35N7O
Mol. Mass.:
425.5703
SMILES:
CCCCNc1ncc(c(NC2CC[C@H](O)CC2)n1)-c1cc(NC2CCCC2)ncn1
: