Target
Growth arrest-specific protein 6
Ligand
BDBM308307
Substrate
Meas. Tech.
Activity Assay
IC50
82.0±n/a nM
Citation
 Wang, XZhang, WFrye, S Therapeutic uses of selected pyrimidine compounds with anti-Mer tyrosine kinase activity US Patent  US9649309 Publication Date 5/16/2017 
Target
Name:
Growth arrest-specific protein 6
Synonyms:
AXL receptor tyrosine kinase ligand GAS-6 GAS6_HUMAN
Type:
PROTEIN
Mol. Mass.:
74914.43
Organism:
Homo sapiens (Human)
Description:
Q14393
Residue:
678
  
Inhibitor
Name:
BDBM308307
Synonyms:
US9649309, Compound UNC4268A
Type:
Small organic molecule
Emp. Form.:
C24H31N7O
Mol. Mass.:
433.5492
SMILES:
CCCCNc1ncc(c(N[C@H]2CC[C@H](O)CC2)n1)-c1cc(Nc2ccccc2)ncn1
: