Target
Growth arrest-specific protein 6
Ligand
BDBM308310
Substrate
Meas. Tech.
Activity Assay
IC50
194±n/a nM
Citation
 Wang, XZhang, WFrye, S Therapeutic uses of selected pyrimidine compounds with anti-Mer tyrosine kinase activity US Patent  US9649309 Publication Date 5/16/2017 
Target
Name:
Growth arrest-specific protein 6
Synonyms:
AXL receptor tyrosine kinase ligand GAS-6 GAS6_HUMAN
Type:
PROTEIN
Mol. Mass.:
74914.43
Organism:
Homo sapiens (Human)
Description:
Q14393
Residue:
678
  
Inhibitor
Name:
BDBM308310
Synonyms:
US9649309, Compound UNC4272A
Type:
Small organic molecule
Emp. Form.:
C25H33N7O2
Mol. Mass.:
463.5752
SMILES:
CCCCNc1ncc(c(N[C@H]2CC[C@H](O)CC2)n1)-c1cc(Nc2ccccc2OC)ncn1
: