Target
Receptor-type tyrosine-protein kinase FLT3
Ligand
BDBM308334
Substrate
Meas. Tech.
Activity Assay
IC50
1.10±n/a nM
Citation
 Wang, XZhang, WFrye, S Therapeutic uses of selected pyrimidine compounds with anti-Mer tyrosine kinase activity US Patent  US9649309 Publication Date 5/16/2017 
Target
Name:
Receptor-type tyrosine-protein kinase FLT3
Synonyms:
CD135 FL cytokine receptor FLK2 FLT3 Fetal liver kinase-2 Fms-like tyrosine kinase 3 (Flt-3) STK-1 Stem cell tyrosine kinase 1
Type:
Enzyme
Mol. Mass.:
112888.62
Organism:
Homo sapiens (Human)
Description:
P36888
Residue:
993
  
Inhibitor
Name:
BDBM308334
Synonyms:
US9649309, Compound UNC4241A
Type:
Small organic molecule
Emp. Form.:
C26H31FN6O
Mol. Mass.:
462.5623
SMILES:
O[C@H]1CC[C@@H](CC1)Nc1nc(Nc2ccc(F)cc2)ncc1-c1ccc(CN2CCCC2)cn1
: