Target
Growth arrest-specific protein 6
Ligand
BDBM308335
Substrate
Meas. Tech.
Activity Assay
IC50
1.20±n/a nM
Citation
 Wang, XZhang, WFrye, S Therapeutic uses of selected pyrimidine compounds with anti-Mer tyrosine kinase activity US Patent  US9649309 Publication Date 5/16/2017 
Target
Name:
Growth arrest-specific protein 6
Synonyms:
AXL receptor tyrosine kinase ligand GAS-6 GAS6_HUMAN
Type:
PROTEIN
Mol. Mass.:
74914.43
Organism:
Homo sapiens (Human)
Description:
Q14393
Residue:
678
  
Inhibitor
Name:
BDBM308335
Synonyms:
US9649309, Compound UNC4242A
Type:
Small organic molecule
Emp. Form.:
C27H34N6O
Mol. Mass.:
458.5985
SMILES:
Cc1ccc(Nc2ncc(c(N[C@H]3CC[C@H](O)CC3)n2)-c2ccc(CN3CCCC3)cn2)cc1
: