Target
Growth arrest-specific protein 6
Ligand
BDBM308352
Substrate
Meas. Tech.
Activity Assay
IC50
12.0±n/a nM
Citation
 Wang, XZhang, WFrye, S Therapeutic uses of selected pyrimidine compounds with anti-Mer tyrosine kinase activity US Patent  US9649309 Publication Date 5/16/2017 
Target
Name:
Growth arrest-specific protein 6
Synonyms:
AXL receptor tyrosine kinase ligand GAS-6 GAS6_HUMAN
Type:
PROTEIN
Mol. Mass.:
74914.43
Organism:
Homo sapiens (Human)
Description:
Q14393
Residue:
678
  
Inhibitor
Name:
BDBM308352
Synonyms:
US9649309, Compound UNC4168A
Type:
Small organic molecule
Emp. Form.:
C27H42N6O
Mol. Mass.:
466.662
SMILES:
CCCCNc1ncc(c(N[C@H]2CC[C@H](O)CC2)n1)-c1ccc(CNC2C(C)(C)C2(C)C)cn1
: