Target
Enteropeptidase
Ligand
BDBM158076
Substrate
Meas. Tech.
Inhibitory Activity Assay
Ki
0.460±n/a nM
Citation
 Koshiba, TTokumasu, MIchimaru, TOhsumi, KNakagawa, TYamada, TMatsumoto, KSuzuki, T Heteroarylcarboxylic acid ester derivative US Patent  US9655879 Publication Date 5/23/2017 
Target
Name:
Enteropeptidase
Synonyms:
ENTK PRSS7 | TMPRSS15
Type:
Enzyme
Mol. Mass.:
112901.62
Organism:
Homo sapiens (Human)
Description:
P98073
Residue:
1019
  
Inhibitor
Name:
BDBM158076
Synonyms:
US9024044, 4 US9655879, 4
Type:
Small organic molecule
Emp. Form.:
C20H22FN3O6S
Mol. Mass.:
451.469
SMILES:
CC(C)(Cc1ccc(s1)C(=O)Oc1ccc(cc1F)C(N)=N)C(=O)N[C@@H](CO)C(O)=O
: