Target
Enteropeptidase
Ligand
BDBM308498
Substrate
Meas. Tech.
Inhibitory Activity Assay
Ki
2.56±n/a nM
Citation
 Koshiba, TTokumasu, MIchimaru, TOhsumi, KNakagawa, TYamada, TMatsumoto, KSuzuki, T Heteroarylcarboxylic acid ester derivative US Patent  US9655879 Publication Date 5/23/2017 
Target
Name:
Enteropeptidase
Synonyms:
ENTK PRSS7 | TMPRSS15
Type:
Enzyme
Mol. Mass.:
112901.62
Organism:
Homo sapiens (Human)
Description:
P98073
Residue:
1019
  
Inhibitor
Name:
BDBM308498
Synonyms:
US9655879, 34
Type:
Small organic molecule
Emp. Form.:
C23H27ClFN3O5S
Mol. Mass.:
511.994
SMILES:
Cl.CCC(CC)(Cc1ccc(s1)C(=O)Oc1ccc(cc1F)C(N)=N)C(=O)N[C@@H]1COC(=O)C1
: