Target
Serine protease 1
Ligand
BDBM308513
Substrate
Meas. Tech.
Inhibitory Activity Assay
Ki
1.97±n/a nM
Citation
 Koshiba, TTokumasu, MIchimaru, TOhsumi, KNakagawa, TYamada, TMatsumoto, KSuzuki, T Heteroarylcarboxylic acid ester derivative US Patent  US9655879 Publication Date 5/23/2017 
Target
Name:
Serine protease 1
Synonyms:
Alpha-trypsin chain 1 Beta-trypsin PRSS1 TRP1 TRY1_HUMAN Thrombin & trypsin Trypsin I | Trypsin-1
Type:
Enzyme
Mol. Mass.:
26557.80
Organism:
Homo sapiens (Human)
Description:
P07477
Residue:
247
  
Inhibitor
Name:
BDBM308513
Synonyms:
US9655879, 49
Type:
Small organic molecule
Emp. Form.:
C26H35ClFN3O5S
Mol. Mass.:
556.09
SMILES:
Cl.CCC(C)[C@@H](CC(O)=O)NC(=O)C(CC)(CC)Cc1ccc(s1)C(=O)Oc1ccc(cc1F)C(N)=N
: