Target
Serine protease 1
Ligand
BDBM158137
Substrate
Meas. Tech.
Inhibitory Activity Assay
Ki
0.750±n/a nM
Citation
 Koshiba, TTokumasu, MIchimaru, TOhsumi, KNakagawa, TYamada, TMatsumoto, KSuzuki, T Heteroarylcarboxylic acid ester derivative US Patent  US9655879 Publication Date 5/23/2017 
Target
Name:
Serine protease 1
Synonyms:
Alpha-trypsin chain 1 Beta-trypsin PRSS1 TRP1 TRY1_HUMAN Thrombin & trypsin Trypsin I | Trypsin-1
Type:
Enzyme
Mol. Mass.:
26557.80
Organism:
Homo sapiens (Human)
Description:
P07477
Residue:
247
  
Inhibitor
Name:
BDBM158137
Synonyms:
BDBM308529 US9227949, 65
Type:
Small organic molecule
Emp. Form.:
C19H20FN7O3S
Mol. Mass.:
445.471
SMILES:
CC(C)(Cc1ccc(s1)C(=O)Oc1ccc(cc1F)C(N)=N)C(=O)NCc1nnn[nH]1
: