Target
Enteropeptidase
Ligand
BDBM158139
Substrate
Meas. Tech.
Inhibitory Activity Assay
Ki
3.73±n/a nM
Citation
 Koshiba, TTokumasu, MIchimaru, TOhsumi, KNakagawa, TYamada, TMatsumoto, KSuzuki, T Heteroarylcarboxylic acid ester derivative US Patent  US9655879 Publication Date 5/23/2017 
Target
Name:
Enteropeptidase
Synonyms:
ENTK PRSS7 | TMPRSS15
Type:
Enzyme
Mol. Mass.:
112901.62
Organism:
Homo sapiens (Human)
Description:
P98073
Residue:
1019
  
Inhibitor
Name:
BDBM158139
Synonyms:
US9024044, 67 US9655879, 67
Type:
Small organic molecule
Emp. Form.:
C28H28FN3O7S
Mol. Mass.:
569.601
SMILES:
CCC(CC)(Cc1ccc(s1)C(=O)Oc1ccc(cc1F)C(N)=N)C(=O)Nc1cc(cc(c1)C(=O)OC)C(O)=O
: