Target
Enteropeptidase
Ligand
BDBM158146
Substrate
Meas. Tech.
Inhibitory Activity Assay
Ki
0.580±n/a nM
Citation
 Koshiba, TTokumasu, MIchimaru, TOhsumi, KNakagawa, TYamada, TMatsumoto, KSuzuki, T Heteroarylcarboxylic acid ester derivative US Patent  US9655879 Publication Date 5/23/2017 
Target
Name:
Enteropeptidase
Synonyms:
ENTK PRSS7 | TMPRSS15
Type:
Enzyme
Mol. Mass.:
112901.62
Organism:
Homo sapiens (Human)
Description:
P98073
Residue:
1019
  
Inhibitor
Name:
BDBM158146
Synonyms:
US9024044, 74 US9655879, 74
Type:
Small organic molecule
Emp. Form.:
C24H22FN3O6S
Mol. Mass.:
499.511
SMILES:
CC(C)(Cc1ccc(s1)C(=O)Oc1ccc(cc1F)C(N)=N)C(=O)Nc1cc(O)cc(c1)C(O)=O
: