Target
Enteropeptidase
Ligand
BDBM308556
Substrate
Meas. Tech.
Inhibitory Activity Assay
Ki
0.670±n/a nM
Citation
 Koshiba, TTokumasu, MIchimaru, TOhsumi, KNakagawa, TYamada, TMatsumoto, KSuzuki, T Heteroarylcarboxylic acid ester derivative US Patent  US9655879 Publication Date 5/23/2017 
Target
Name:
Enteropeptidase
Synonyms:
ENTK PRSS7 | TMPRSS15
Type:
Enzyme
Mol. Mass.:
112901.62
Organism:
Homo sapiens (Human)
Description:
P98073
Residue:
1019
  
Inhibitor
Name:
BDBM308556
Synonyms:
US9655879, 92
Type:
Small organic molecule
Emp. Form.:
C25H25ClFN3O6S
Mol. Mass.:
549.999
SMILES:
Cl.CC(C)(Cc1ccc(s1)C(=O)Oc1ccc(cc1F)C(N)=N)C(=O)N[C@H](C(O)=O)c1ccc(O)cc1
: