Target
Mast/stem cell growth factor receptor Kit
Ligand
BDBM8829
Substrate
biotinylated synthetic peptide
Meas. Tech.
Homogeneous Time-resolved Fluorescence (HTRF) Assay
IC50
68±n/a nM
Citation
 Dai, YGuo, YFrey, RRJi, ZCurtin, MLAhmed, AAAlbert, DHArnold, LArries, SSBarlozzari, TBauch, JLBouska, JJBousquet, PFCunha, GAGlaser, KBGuo, JLi, JMarcotte, PAMarsh, KCMoskey, MDPease, LJStewart, KDStoll, VSTapang, PWishart, NDavidsen, SKMichaelides, MR Thienopyrimidine ureas as novel and potent multitargeted receptor tyrosine kinase inhibitors. J Med Chem 48:6066-83 (2005)  
Target
Name:
Mast/stem cell growth factor receptor Kit
Synonyms:
CD117 antigen KIT Mast/stem cell growth factor receptor Kit (cKIT) Proto-oncogene tyrosine-protein kinase Kit Stem cell growth factor receptor Tyrosine-protein kinase Kit c-kit v-kit Hardy-Zuckerman 4 feline sarcoma viral oncogene homolog
Type:
Protein
Mol. Mass.:
109869.37
Organism:
Homo sapiens (Human)
Description:
P10721
Residue:
976
  
Inhibitor
Name:
BDBM8829
Synonyms:
3-(4-{4-amino-6-methylthieno[2,3-d]pyrimidin-5-yl}phenyl)-1-(2-methylphenyl)urea Thienopyrimidine deriv. 10
Type:
Small organic molecule
Emp. Form.:
C21H19N5OS
Mol. Mass.:
389.473
SMILES:
Cc1sc2ncnc(N)c2c1-c1ccc(NC(=O)Nc2ccccc2C)cc1
:
Substrate
Name:
biotinylated synthetic peptide
Synonyms:
Type:
Peptide
Mol. Mass.:
2470.20
Organism:
Description:
Residue:
21