Target
Mast/stem cell growth factor receptor Kit
Ligand
BDBM8849
Substrate
biotinylated synthetic peptide
Meas. Tech.
Homogeneous Time-resolved Fluorescence (HTRF) Assay
IC50
930±n/a nM
Citation
 Dai, YGuo, YFrey, RRJi, ZCurtin, MLAhmed, AAAlbert, DHArnold, LArries, SSBarlozzari, TBauch, JLBouska, JJBousquet, PFCunha, GAGlaser, KBGuo, JLi, JMarcotte, PAMarsh, KCMoskey, MDPease, LJStewart, KDStoll, VSTapang, PWishart, NDavidsen, SKMichaelides, MR Thienopyrimidine ureas as novel and potent multitargeted receptor tyrosine kinase inhibitors. J Med Chem 48:6066-83 (2005)  
Target
Name:
Mast/stem cell growth factor receptor Kit
Synonyms:
CD117 antigen KIT Mast/stem cell growth factor receptor Kit (cKIT) Proto-oncogene tyrosine-protein kinase Kit Stem cell growth factor receptor Tyrosine-protein kinase Kit c-kit v-kit Hardy-Zuckerman 4 feline sarcoma viral oncogene homolog
Type:
Protein
Mol. Mass.:
109869.37
Organism:
Homo sapiens (Human)
Description:
P10721
Residue:
976
  
Inhibitor
Name:
BDBM8849
Synonyms:
3-[4-amino-5-(4-{[(3-methylphenyl)carbamoyl]amino}phenyl)thieno[2,3-d]pyrimidin-6-yl]-N,N-dimethylpropanamide Thienopyrimidine deriv. 53
Type:
Small organic molecule
Emp. Form.:
C25H26N6O2S
Mol. Mass.:
474.578
SMILES:
CN(C)C(=O)CCc1sc2ncnc(N)c2c1-c1ccc(NC(=O)Nc2cccc(C)c2)cc1
:
Substrate
Name:
biotinylated synthetic peptide
Synonyms:
Type:
Peptide
Mol. Mass.:
2470.20
Organism:
Description:
Residue:
21