Target
Vascular endothelial growth factor receptor 2
Ligand
BDBM8854
Substrate
biotinylated synthetic peptide
Meas. Tech.
Homogeneous Time-resolved Fluorescence (HTRF) Assay
IC50
130±n/a nM
Citation
 Dai, YGuo, YFrey, RRJi, ZCurtin, MLAhmed, AAAlbert, DHArnold, LArries, SSBarlozzari, TBauch, JLBouska, JJBousquet, PFCunha, GAGlaser, KBGuo, JLi, JMarcotte, PAMarsh, KCMoskey, MDPease, LJStewart, KDStoll, VSTapang, PWishart, NDavidsen, SKMichaelides, MR Thienopyrimidine ureas as novel and potent multitargeted receptor tyrosine kinase inhibitors. J Med Chem 48:6066-83 (2005)  
Target
Name:
Vascular endothelial growth factor receptor 2
Synonyms:
CD_antigen=CD309 Fetal liver kinase 1 (FLK-1) KDR Protein-tyrosine kinase receptor Flk-1 VEGFR-2 VEGFR2 Vascular Endothelial Growth Factor Receptor Kinase 2 Vascular endothelial growth factor receptor 2 (KDR) Vascular endothelial growth factor receptor 2 (VEGFR2) Vascular endothelial growth factor receptor-2 (VEGFR-2)
Type:
Receptor Tyrosine Kinase
Mol. Mass.:
151510.97
Organism:
Homo sapiens (Human)
Description:
P35968
Residue:
1356
  
Inhibitor
Name:
BDBM8854
Synonyms:
3-{4-[4-amino-6-(propan-2-yl)thieno[2,3-d]pyrimidin-5-yl]phenyl}-1-(3-methylphenyl)urea Thienopyrimidine deriv. 80
Type:
Small organic molecule
Emp. Form.:
C23H23N5OS
Mol. Mass.:
417.527
SMILES:
CC(C)c1sc2ncnc(N)c2c1-c1ccc(NC(=O)Nc2cccc(C)c2)cc1
:
Substrate
Name:
biotinylated synthetic peptide
Synonyms:
Type:
Peptide
Mol. Mass.:
2470.20
Organism:
Description:
Residue:
21