Target
Mast/stem cell growth factor receptor Kit
Ligand
BDBM8863
Substrate
biotinylated synthetic peptide
Meas. Tech.
Homogeneous Time-resolved Fluorescence (HTRF) Assay
IC50
200±n/a nM
Citation
 Dai, YGuo, YFrey, RRJi, ZCurtin, MLAhmed, AAAlbert, DHArnold, LArries, SSBarlozzari, TBauch, JLBouska, JJBousquet, PFCunha, GAGlaser, KBGuo, JLi, JMarcotte, PAMarsh, KCMoskey, MDPease, LJStewart, KDStoll, VSTapang, PWishart, NDavidsen, SKMichaelides, MR Thienopyrimidine ureas as novel and potent multitargeted receptor tyrosine kinase inhibitors. J Med Chem 48:6066-83 (2005)  
Target
Name:
Mast/stem cell growth factor receptor Kit
Synonyms:
CD117 antigen KIT Mast/stem cell growth factor receptor Kit (cKIT) Proto-oncogene tyrosine-protein kinase Kit Stem cell growth factor receptor Tyrosine-protein kinase Kit c-kit v-kit Hardy-Zuckerman 4 feline sarcoma viral oncogene homolog
Type:
Protein
Mol. Mass.:
109869.37
Organism:
Homo sapiens (Human)
Description:
P10721
Residue:
976
  
Inhibitor
Name:
BDBM8863
Synonyms:
3-(4-{4-aminothieno[2,3-d]pyrimidin-5-yl}-3-chlorophenyl)-1-(3-methylphenyl)urea Thienopyrimidine deriv. 89
Type:
Small organic molecule
Emp. Form.:
C20H16ClN5OS
Mol. Mass.:
409.892
SMILES:
Cc1cccc(NC(=O)Nc2ccc(-c3csc4ncnc(N)c34)c(Cl)c2)c1
:
Substrate
Name:
biotinylated synthetic peptide
Synonyms:
Type:
Peptide
Mol. Mass.:
2470.20
Organism:
Description:
Residue:
21