Target
Sodium channel protein type 9 subunit alpha
Ligand
BDBM309345
Substrate
Meas. Tech.
FLIPR Assay
IC50
320±50 nM
Citation
 Ni, CPark, MShao, BTafesse, LYao, JYoungman, MAZhou, X Substituted pyridines as sodium channel blockers US Patent  US9656959 Publication Date 5/23/2017 
Target
Name:
Sodium channel protein type 9 subunit alpha
Synonyms:
NENA Peripheral sodium channel 1 SCN9A_HUMAN Voltage-gated sodium channel subunit Nav1.7 hNE-Na
Type:
Protein
Mol. Mass.:
226375.97
Organism:
Homo sapiens (Human)
Description:
Q15858
Residue:
1988
  
Inhibitor
Name:
BDBM309345
Synonyms:
N-(6-(4-(4-fluorophenoxy)phenyl)pyridin-2-yl)-1-methyl-1H-imidazole-4-sulfonamide | US9656959, Example 29
Type:
Small organic molecule
Emp. Form.:
C21H17FN4O3S
Mol. Mass.:
424.448
SMILES:
Cn1cnc(c1)S(=O)(=O)Nc1cccc(n1)-c1ccc(Oc2ccc(F)cc2)cc1
: