Target
Mu-type opioid receptor
Ligand
BDBM309330
Substrate
Meas. Tech.
Opioid Receptor Binding Assay
IC50
2.20±n/a nM
Citation
 Blumberg, LCDeaver, DREyerman, DJWynn, TA Methods for treating depressive symptoms US Patent  US9656961 Publication Date 5/23/2017 
Target
Name:
Mu-type opioid receptor
Synonyms:
M-OR-1 MOR-1 MUOR1 Mu opiate receptor OPRM1 hMOP | mu-type opioid receptor isoform MOR-1
Type:
G Protein-Coupled Receptor (GPCR)
Mol. Mass.:
44789.51
Organism:
Homo sapiens (Human)
Description:
P35372
Residue:
400
  
Inhibitor
Name:
BDBM309330
Synonyms:
US10231963, Table B.2 US9656961, Example 00119
Type:
Small organic molecule
Emp. Form.:
C21H29NO
Mol. Mass.:
311.4611
SMILES:
C[C@H](C1CC1)N1CC[C@]23CCCC[C@H]2[C@H]1Cc1ccc(O)cc31
: