Target
Mu-type opioid receptor
Ligand
BDBM309435
Substrate
Meas. Tech.
Opioid Receptor Binding Assay
IC50
1.10±n/a nM
Citation
 Blumberg, LCDeaver, DREyerman, DJWynn, TA Methods for treating depressive symptoms US Patent  US9656961 Publication Date 5/23/2017 
Target
Name:
Mu-type opioid receptor
Synonyms:
M-OR-1 MOR-1 MUOR1 Mu opiate receptor OPRM1 hMOP | mu-type opioid receptor isoform MOR-1
Type:
G Protein-Coupled Receptor (GPCR)
Mol. Mass.:
44789.51
Organism:
Homo sapiens (Human)
Description:
P35372
Residue:
400
  
Inhibitor
Name:
BDBM309435
Synonyms:
US9656961, Example 00155
Type:
Small organic molecule
Emp. Form.:
C34H40N2O2
Mol. Mass.:
508.6936
SMILES:
COc1cccc(c1)-c1ccc(CCNC(=O)c2ccc3C[C@@H]4[C@H](C)[C@](C)(CCN4CC4CC4)c3c2)cc1
: