Target
Mu-type opioid receptor
Ligand
BDBM309438
Substrate
Meas. Tech.
Opioid Receptor Binding Assay
Ki
0.270±n/a nM
Citation
 Blumberg, LCDeaver, DREyerman, DJWynn, TA Methods for treating depressive symptoms US Patent  US9656961 Publication Date 5/23/2017 
Target
Name:
Mu-type opioid receptor
Synonyms:
M-OR-1 MOR-1 MUOR1 Mu opiate receptor OPRM1 hMOP | mu-type opioid receptor isoform MOR-1
Type:
G Protein-Coupled Receptor (GPCR)
Mol. Mass.:
44789.51
Organism:
Homo sapiens (Human)
Description:
P35372
Residue:
400
  
Inhibitor
Name:
BDBM309438
Synonyms:
US10287250, Compound C.8 | US9656961, Example 00158
Type:
Small organic molecule
Emp. Form.:
C30H36N4O
Mol. Mass.:
468.633
SMILES:
CC1[C@H]2Cc3ccc(cc3[C@@]1(C)CCN2CC1CC1)C(=O)NCCc1ccc(cc1)-c1cn[nH]c1
: