Target
Mu-type opioid receptor
Ligand
BDBM179892
Substrate
Meas. Tech.
Opioid Receptor Binding Assay
EC50
62.0±n/a nM
Citation
 Blumberg, LCDeaver, DREyerman, DJWynn, TA Methods for treating depressive symptoms US Patent  US9656961 Publication Date 5/23/2017 
Target
Name:
Mu-type opioid receptor
Synonyms:
M-OR-1 MOR-1 MUOR1 Mu opiate receptor OPRM1 hMOP | mu-type opioid receptor isoform MOR-1
Type:
G Protein-Coupled Receptor (GPCR)
Mol. Mass.:
44789.51
Organism:
Homo sapiens (Human)
Description:
P35372
Residue:
400
  
Inhibitor
Name:
BDBM179892
Synonyms:
US10287250, Compound C.11 US9133125, Table C, Compound 10 US9656961, Example 00161
Type:
Small organic molecule
Emp. Form.:
C17H24N2O
Mol. Mass.:
272.3853
SMILES:
C[C@@]12CCCCC[C@@H](Cc3ccc(cc13)C(N)=O)[C@@H]2N
: