Target
Mu-type opioid receptor
Ligand
BDBM179895
Substrate
Meas. Tech.
Opioid Receptor Binding Assay
Ki
4.40±n/a nM
Citation
 Blumberg, LCDeaver, DREyerman, DJWynn, TA Methods for treating depressive symptoms US Patent  US9656961 Publication Date 5/23/2017 
Target
Name:
Mu-type opioid receptor
Synonyms:
M-OR-1 MOR-1 MUOR1 Mu opiate receptor OPRM1 hMOP | mu-type opioid receptor isoform MOR-1
Type:
G Protein-Coupled Receptor (GPCR)
Mol. Mass.:
44789.51
Organism:
Homo sapiens (Human)
Description:
P35372
Residue:
400
  
Inhibitor
Name:
BDBM179895
Synonyms:
US10287250, Compound C.13 US9133125, Table C, Compound 13 | US9656961, Example 00163
Type:
Small organic molecule
Emp. Form.:
C21H34N2O2
Mol. Mass.:
346.5069
SMILES:
CCCCCCN1CCC(CC1)(C(=O)N(C)CC)c1cccc(O)c1
: