Target
Mu-type opioid receptor
Ligand
BDBM179899
Substrate
Meas. Tech.
Opioid Receptor Binding Assay
IC50
43.0±n/a nM
Citation
 Blumberg, LCDeaver, DREyerman, DJWynn, TA Methods for treating depressive symptoms US Patent  US9656961 Publication Date 5/23/2017 
Target
Name:
Mu-type opioid receptor
Synonyms:
M-OR-1 MOR-1 MUOR1 Mu opiate receptor OPRM1 hMOP | mu-type opioid receptor isoform MOR-1
Type:
G Protein-Coupled Receptor (GPCR)
Mol. Mass.:
44789.51
Organism:
Homo sapiens (Human)
Description:
P35372
Residue:
400
  
Inhibitor
Name:
BDBM179899
Synonyms:
US10231963, Table C.3 US10736890, Compound TABLE C.3 US11534436, Compound Table C.3 US9656961, Example 00167
Type:
Small organic molecule
Emp. Form.:
C22H28N2O4
Mol. Mass.:
384.4687
SMILES:
C[C@H](C1CC1)N1CC[C@]23CC(=O)CC[C@@]2(O)[C@H]1Cc1ccc(C(N)=O)c(O)c31
: