Target
Kappa-type opioid receptor
Ligand
BDBM309408
Substrate
Meas. Tech.
ORL-1 Receptor Binding Assay
Ki
0.750±0.13 nM
Citation
 Lockman, JTafesse, L Ring-contracted morphinans and the use thereof US Patent  US9656962 Publication Date 5/23/2017 
Target
Name:
Kappa-type opioid receptor
Synonyms:
K-OR-1 Kappa-opioid receptor (KOR) Kappa-type opioid receptor (KOR) OPIATE Kappa OPRK1 kappa opioid receptor (KOR)
Type:
G Protein-Coupled Receptor (GPCR)
Mol. Mass.:
42648.76
Organism:
Homo sapiens (Human)
Description:
P41145
Residue:
380
  
Inhibitor
Name:
BDBM309408
Synonyms:
(2R,3aS,4R,9bS)-N-benzyl-12- (cyclopropylmethyl)-3a,8-dihydroxy- 1,2,3,3a,4,5-hexahydro-4,9b- (epiminoethano)cyclopenta[a]naphthalene- 2-carboxamide | US9656962, Compound 33
Type:
Small organic molecule
Emp. Form.:
C27H32N2O3
Mol. Mass.:
432.5546
SMILES:
Oc1ccc2C[C@H]3N(CC4CC4)CC[C@@]4(C[C@H](C[C@@]34O)C(=O)NCc3ccccc3)c2c1
: