Target
Kappa-type opioid receptor
Ligand
BDBM309432
Substrate
Meas. Tech.
ORL-1 Receptor Binding Assay
EC50
0.030±0.01 nM
Citation
 Lockman, JTafesse, L Ring-contracted morphinans and the use thereof US Patent  US9656962 Publication Date 5/23/2017 
Target
Name:
Kappa-type opioid receptor
Synonyms:
K-OR-1 Kappa-opioid receptor (KOR) Kappa-type opioid receptor (KOR) OPIATE Kappa OPRK1 kappa opioid receptor (KOR)
Type:
G Protein-Coupled Receptor (GPCR)
Mol. Mass.:
42648.76
Organism:
Homo sapiens (Human)
Description:
P41145
Residue:
380
  
Inhibitor
Name:
BDBM309432
Synonyms:
(2S,3aS,4R,9bS)-12-(cyclopropylmethyl)- N-(3,4-dichlorobenzyl)-3a,8-dihydroxy- 1,2,3,3a,4,5-hexahydro-4,9b-(epimino- ethano)cyclopenta[a]naphthalene-2- carboxamide | US9656962, Compound 47
Type:
Small organic molecule
Emp. Form.:
C27H30Cl2N2O3
Mol. Mass.:
501.445
SMILES:
Oc1ccc2C[C@H]3N(CC4CC4)CC[C@@]4(C[C@@H](C[C@@]34O)C(=O)NCc3ccc(Cl)c(Cl)c3)c2c1
: