Target
Mu-type opioid receptor
Ligand
BDBM309440
Substrate
Meas. Tech.
δ-Opioid Receptor Binding Assay
EC50
>20000±n/a nM
Citation
 Lockman, JTafesse, L Ring-contracted morphinans and the use thereof US Patent  US9656962 Publication Date 5/23/2017 
Target
Name:
Mu-type opioid receptor
Synonyms:
M-OR-1 MOR-1 MUOR1 Mu opiate receptor OPRM1 hMOP | mu-type opioid receptor isoform MOR-1
Type:
G Protein-Coupled Receptor (GPCR)
Mol. Mass.:
44789.51
Organism:
Homo sapiens (Human)
Description:
P35372
Residue:
400
  
Inhibitor
Name:
BDBM309440
Synonyms:
(2R,3aS,4R,9bS)-N-(2-amino-2-oxoethyl)- 12-(cyclopropylmethyl)-3a,8-dihydroxy- 1,2,3,3a,4,5-hexahydro-4,9b- (epiminoethano)cyclopenta[a]naphthalene- 2-carboxamide | US9656962, Compound 64
Type:
Small organic molecule
Emp. Form.:
C22H29N3O4
Mol. Mass.:
399.4834
SMILES:
NC(=O)CNC(=O)[C@H]1C[C@@]2(O)[C@H]3Cc4ccc(O)cc4[C@]2(C1)CCN3CC1CC1
: