Target
Sodium channel protein type 9 subunit alpha
Ligand
BDBM185950
Substrate
Meas. Tech.
FLIPR Assay
IC50
950±n/a nM
Citation
 Ni, CTafesse, LYao, JYoungman, MPark, MShao, B Pyrimidines as sodium channel blockers US Patent  US9656968 Publication Date 5/23/2017 
Target
Name:
Sodium channel protein type 9 subunit alpha
Synonyms:
NENA Peripheral sodium channel 1 SCN9A_HUMAN Voltage-gated sodium channel subunit Nav1.7 hNE-Na
Type:
Protein
Mol. Mass.:
226375.97
Organism:
Homo sapiens (Human)
Description:
Q15858
Residue:
1988
  
Inhibitor
Name:
BDBM185950
Synonyms:
US9163008, 39 | US9656968, Compound 39
Type:
Small organic molecule
Emp. Form.:
C22H20FN3O5
Mol. Mass.:
425.4097
SMILES:
COC(=O)[C@H](C)Nc1cc(nc(n1)-c1ccc(Oc2ccc(F)cc2)cc1)C(=O)OC
: