Target
Sodium channel protein type 9 subunit alpha
Ligand
BDBM185970
Substrate
Meas. Tech.
FLIPR Assay
IC50
2040±n/a nM
Citation
 Ni, CTafesse, LYao, JYoungman, MPark, MShao, B Pyrimidines as sodium channel blockers US Patent  US9656968 Publication Date 5/23/2017 
Target
Name:
Sodium channel protein type 9 subunit alpha
Synonyms:
NENA Peripheral sodium channel 1 SCN9A_HUMAN Voltage-gated sodium channel subunit Nav1.7 hNE-Na
Type:
Protein
Mol. Mass.:
226375.97
Organism:
Homo sapiens (Human)
Description:
Q15858
Residue:
1988
  
Inhibitor
Name:
BDBM185970
Synonyms:
US9163008, 59 | US9656968, Compound 59
Type:
Small organic molecule
Emp. Form.:
C20H17F3N6O3
Mol. Mass.:
446.3826
SMILES:
C[C@H](Nc1cc(nc(n1)-c1ccc(Oc2cccc(n2)C(F)(F)F)cc1)C(N)=O)C(N)=O
: